{"text_format":"1","workbook":"xlsx","n_sheets":11,"sheets":["Introduction","References","Instructions","Contact Information","Data Inventory","Lists","Intermediate Sheet","Subrecipient Intermediate","FullDatabase","TableDatabase","Resource Inventory Table"],"not_rendered":{"charts":0,"images":1,"macros":1,"external_links":0,"defined_names":9,"comments":0,"pivot_tables":0},"unopened":[],"bounds":{"document_bytes":16777216,"sheet_cells":100000,"rows_first":2000,"rows_last":500,"rows_between":2000,"halvings":0,"cell_chars":16384,"cell_head_chars":4096},"cells_cut":0,"cells_raw":0,"read":"whole","date_system":"1900"}

{"sheet":"Introduction","index":0,"n_rows":0,"n_cols":0,"rows_kept":0,"cut":false,"hidden":false,"merged":[[2,1,2,7],[3,2,14,2],[3,4,3,5]]}

{"sheet":"References","index":1,"n_rows":64,"n_cols":3,"rows_kept":64,"cut":false,"hidden":true,"merged":[]}
[]
[]
[]
[null,"References"]
[]
[null,"Key Term","Defintion and notes"]
{"$rows_left_out":59}
{"sheet":"Instructions","index":2,"n_rows":0,"n_cols":0,"rows_kept":0,"cut":false,"hidden":false,"merged":[[2,1,5,1]]}

{"sheet":"Contact Information","index":3,"n_rows":9,"n_cols":2,"rows_kept":9,"cut":false,"hidden":false,"merged":[]}
[]
[]
[]
[null,"Contact Information"]
[]
[null,"Agency"]
{"$rows_left_out":4}
{"sheet":"Data Inventory","index":4,"n_rows":65,"n_cols":10,"rows_kept":65,"cut":false,"hidden":true,"merged":[]}
[]
[]
[]
[null,"Data Inventory"]
[]
[]
{"$rows_left_out":60}
{"sheet":"Lists","index":5,"n_rows":9,"n_cols":16,"rows_kept":9,"cut":false,"hidden":true,"merged":[]}
["Services Delivered by Funder",null,"these lists feed into the services delivered dropdown"]
[null,null,null,null,null,null,null,null,null,null,null,"Inventory Helper Table",null,null,null,"Pass through/Implementing"]
["RWHAP",null,"CDC",null,"HOPWA"]
["RWHAP 1",null,"CDC1",null,"HOPWA1",null,null,null,null,null,null,"Funder Specific Service","Generalized Service",null,null,"Type of service"]
["RWHAP 2",null,"CDC2",null,"HOPWA2",null,null,null,null,null,null,null,null,null,null,"Pass Through"]
["RWHAP 3",null,"CDC3",null,"HOPWA3",null,null,null,null,null,null,null,null,null,null,"Implementing"]
{"$rows_left_out":4}
{"sheet":"Intermediate Sheet","index":6,"n_rows":38,"n_cols":35,"rows_kept":38,"cut":false,"hidden":true,"merged":[]}
["Organization/Agency","Contact Name","Position","Email","Funder*","Funder Bureau/Division*","Name of Funding Source*","NOFO/RFA Number","EHE Funding","Primary Recipient","Total Contract Award Amount","Funding Amount (Pass through)","Funding Amount (implementing)","Contract Start Date","Contract End Date","Contract Number","Budget Year","Estimated Annual Budget","Service Delivered","Type of Service","Annual Budget","Geographical Area","Priority Population","Clients Served","Units Delivered","Additional Details","HIV Diagnosis","Linkage to Care","Engagement or Retention in Care","Prescription of ART","Viral Suppression","Diagnose","Treat","Prevent","Respond"]
[{"$f":"'Contact Information'!$C$6","v":0},{"$f":"'Contact Information'!$C$7","v":0},{"$f":"'Contact Information'!$C$8","v":0},{"$f":"'Contact Information'!$C$9","v":0},{"$f":"#REF!","v":{"$error":"#REF!"}},{"$f":"#REF!","v":{"$error":"#REF!"}},{"$f":"#REF!","v":{"$error":"#REF!"}},{"$f":"#REF!","v":{"$error":"#REF!"}},{"$f":"#REF!","v":{"$error":"#REF!"}},{"$f":"#REF!","v":{"$error":"#REF!"}},{"$f":"#REF!","v":{"$error":"#REF!"}},{"$f":"#REF!","v":{"$error":"#REF!"}},{"$f":"#REF!","v":{"$error":"#REF!"}},{"$f":"#REF!","v":{"$error":"#REF!"}},{"$f":"#REF!","v":{"$error":"#REF!"}},{"$f":"#REF!","v":{"$error":"#REF!"}},{"$f":"#REF!","v":{"$error":"#REF!"}},{"$f":"#REF!","v":{"$error":"#REF!"}},{"$f":"#REF!","v":{"$error":"#REF!"}},{"$f":"#REF!","v":{"$error":"#REF!"}},{"$f":"#REF!","v":{"$error":"#REF!"}},{"$f":"#REF!","v":{"$error":"#REF!"}},{"$f":"#REF!","v":{"$error":"#REF!"}},{"$f":"#REF!","v":{"$error":"#REF!"}},{"$f":"#REF!","v":{"$error":"#REF!"}},{"$f":"#REF!","v":{"$error":"#REF!"}},{"$f":"IF(#REF!=\"\",\"\", AA1)","v":{"$error":"#REF!"}},{"$f":"IF(#REF!=\"\",\"\", AB1)","v":{"$error":"#REF!"}},{"$f":"IF(#REF!=\"\",\"\", AC1)","v":{"$error":"#REF!"}},{"$f":"IF(#REF!=\"\",\"\", AD1)","v":{"$error":"#REF!"}},{"$f":"IF(#REF!=\"\",\"\", AE1)","v":{"$error":"#REF!"}},{"$f":"IF(#REF!=\"\",\"\", AF1)","v":{"$error":"#REF!"}},{"$f":"IF(#REF!=\"\",\"\", AG1)","v":{"$error":"#REF!"}},{"$f":"IF(#REF!=\"\",\"\", AH1)","v":{"$error":"#REF!"}},{"$f":"IF(#REF!=\"\",\"\", AI1)","v":{"$error":"#REF!"}}]
[{"$f":"'Contact Information'!$C$6","v":0},{"$f":"'Contact Information'!$C$7","v":0},{"$f":"'Contact Information'!$C$8","v":0},{"$f":"'Contact Information'!$C$9","v":0},{"$f":"#REF!","v":{"$error":"#REF!"}},{"$f":"#REF!","v":{"$error":"#REF!"}},{"$f":"#REF!","v":{"$error":"#REF!"}},{"$f":"#REF!","v":{"$error":"#REF!"}},{"$f":"#REF!","v":{"$error":"#REF!"}},{"$f":"#REF!","v":{"$error":"#REF!"}},{"$f":"#REF!","v":{"$error":"#REF!"}},{"$f":"#REF!","v":{"$error":"#REF!"}},{"$f":"#REF!","v":{"$error":"#REF!"}},{"$f":"#REF!","v":{"$error":"#REF!"}},{"$f":"#REF!","v":{"$error":"#REF!"}},{"$f":"#REF!","v":{"$error":"#REF!"}},{"$f":"#REF!","v":{"$error":"#REF!"}},{"$f":"#REF!","v":{"$error":"#REF!"}},{"$f":"#REF!","v":{"$error":"#REF!"}},{"$f":"#REF!","v":{"$error":"#REF!"}},{"$f":"#REF!","v":{"$error":"#REF!"}},{"$f":"#REF!","v":{"$error":"#REF!"}},{"$f":"#REF!","v":{"$error":"#REF!"}},{"$f":"#REF!","v":{"$error":"#REF!"}},{"$f":"#REF!","v":{"$error":"#REF!"}},{"$f":"#REF!","v":{"$error":"#REF!"}},{"$f":"IF(#REF!=\"\",\"\", AA2)","v":{"$error":"#REF!"}},{"$f":"IF(#REF!=\"\",\"\", AB2)","v":{"$error":"#REF!"}},{"$f":"IF(#REF!=\"\",\"\", AC2)","v":{"$error":"#REF!"}},{"$f":"IF(#REF!=\"\",\"\", AD2)","v":{"$error":"#REF!"}},{"$f":"IF(#REF!=\"\",\"\", AE2)","v":{"$error":"#REF!"}},{"$f":"IF(#REF!=\"\",\"\", AF2)","v":{"$error":"#REF!"}},{"$f":"IF(#REF!=\"\",\"\", AG2)","v":{"$error":"#REF!"}},{"$f":"IF(#REF!=\"\",\"\", AH2)","v":{"$error":"#REF!"}},{"$f":"IF(#REF!=\"\",\"\", AI2)","v":{"$error":"#REF!"}}]
[{"$f":"'Contact Information'!$C$6","v":0},{"$f":"'Contact Information'!$C$7","v":0},{"$f":"'Contact Information'!$C$8","v":0},{"$f":"'Contact Information'!$C$9","v":0},{"$f":"#REF!","v":{"$error":"#REF!"}},{"$f":"#REF!","v":{"$error":"#REF!"}},{"$f":"#REF!","v":{"$error":"#REF!"}},{"$f":"#REF!","v":{"$error":"#REF!"}},{"$f":"#REF!","v":{"$error":"#REF!"}},{"$f":"#REF!","v":{"$error":"#REF!"}},{"$f":"#REF!","v":{"$error":"#REF!"}},{"$f":"#REF!","v":{"$error":"#REF!"}},{"$f":"#REF!","v":{"$error":"#REF!"}},{"$f":"#REF!","v":{"$error":"#REF!"}},{"$f":"#REF!","v":{"$error":"#REF!"}},{"$f":"#REF!","v":{"$error":"#REF!"}},{"$f":"#REF!","v":{"$error":"#REF!"}},{"$f":"#REF!","v":{"$error":"#REF!"}},{"$f":"#REF!","v":{"$error":"#REF!"}},{"$f":"#REF!","v":{"$error":"#REF!"}},{"$f":"#REF!","v":{"$error":"#REF!"}},{"$f":"#REF!","v":{"$error":"#REF!"}},{"$f":"#REF!","v":{"$error":"#REF!"}},{"$f":"#REF!","v":{"$error":"#REF!"}},{"$f":"#REF!","v":{"$error":"#REF!"}},{"$f":"#REF!","v":{"$error":"#REF!"}},{"$f":"IF(#REF!=\"\",\"\", AA3)","v":{"$error":"#REF!"}},{"$f":"IF(#REF!=\"\",\"\", AB3)","v":{"$error":"#REF!"}},{"$f":"IF(#REF!=\"\",\"\", AC3)","v":{"$error":"#REF!"}},{"$f":"IF(#REF!=\"\",\"\", AD3)","v":{"$error":"#REF!"}},{"$f":"IF(#REF!=\"\",\"\", AE3)","v":{"$error":"#REF!"}},{"$f":"IF(#REF!=\"\",\"\", AF3)","v":{"$error":"#REF!"}},{"$f":"IF(#REF!=\"\",\"\", AG3)","v":{"$error":"#REF!"}},{"$f":"IF(#REF!=\"\",\"\", AH3)","v":{"$error":"#REF!"}},{"$f":"IF(#REF!=\"\",\"\", AI3)","v":{"$error":"#REF!"}}]
[{"$f":"'Contact Information'!$C$6","v":0},{"$f":"'Contact Information'!$C$7","v":0},{"$f":"'Contact Information'!$C$8","v":0},{"$f":"'Contact Information'!$C$9","v":0},{"$f":"#REF!","v":{"$error":"#REF!"}},{"$f":"#REF!","v":{"$error":"#REF!"}},{"$f":"#REF!","v":{"$error":"#REF!"}},{"$f":"#REF!","v":{"$error":"#REF!"}},{"$f":"#REF!","v":{"$error":"#REF!"}},{"$f":"#REF!","v":{"$error":"#REF!"}},{"$f":"#REF!","v":{"$error":"#REF!"}},{"$f":"#REF!","v":{"$error":"#REF!"}},{"$f":"#REF!","v":{"$error":"#REF!"}},{"$f":"#REF!","v":{"$error":"#REF!"}},{"$f":"#REF!","v":{"$error":"#REF!"}},{"$f":"#REF!","v":{"$error":"#REF!"}},{"$f":"#REF!","v":{"$error":"#REF!"}},{"$f":"#REF!","v":{"$error":"#REF!"}},{"$f":"#REF!","v":{"$error":"#REF!"}},{"$f":"#REF!","v":{"$error":"#REF!"}},{"$f":"#REF!","v":{"$error":"#REF!"}},{"$f":"#REF!","v":{"$error":"#REF!"}},{"$f":"#REF!","v":{"$error":"#REF!"}},{"$f":"#REF!","v":{"$error":"#REF!"}},{"$f":"#REF!","v":{"$error":"#REF!"}},{"$f":"#REF!","v":{"$error":"#REF!"}},{"$f":"IF(#REF!=\"\",\"\", AA4)","v":{"$error":"#REF!"}},{"$f":"IF(#REF!=\"\",\"\", AB4)","v":{"$error":"#REF!"}},{"$f":"IF(#REF!=\"\",\"\", AC4)","v":{"$error":"#REF!"}},{"$f":"IF(#REF!=\"\",\"\", AD4)","v":{"$error":"#REF!"}},{"$f":"IF(#REF!=\"\",\"\", AE4)","v":{"$error":"#REF!"}},{"$f":"IF(#REF!=\"\",\"\", AF4)","v":{"$error":"#REF!"}},{"$f":"IF(#REF!=\"\",\"\", AG4)","v":{"$error":"#REF!"}},{"$f":"IF(#REF!=\"\",\"\", AH4)","v":{"$error":"#REF!"}},{"$f":"IF(#REF!=\"\",\"\", AI4)","v":{"$error":"#REF!"}}]
[{"$f":"'Contact Information'!$C$6","v":0},{"$f":"'Contact Information'!$C$7","v":0},{"$f":"'Contact Information'!$C$8","v":0},{"$f":"'Contact Information'!$C$9","v":0},{"$f":"#REF!","v":{"$error":"#REF!"}},{"$f":"#REF!","v":{"$error":"#REF!"}},{"$f":"#REF!","v":{"$error":"#REF!"}},{"$f":"#REF!","v":{"$error":"#REF!"}},{"$f":"#REF!","v":{"$error":"#REF!"}},{"$f":"#REF!","v":{"$error":"#REF!"}},{"$f":"#REF!","v":{"$error":"#REF!"}},{"$f":"#REF!","v":{"$error":"#REF!"}},{"$f":"#REF!","v":{"$error":"#REF!"}},{"$f":"#REF!","v":{"$error":"#REF!"}},{"$f":"#REF!","v":{"$error":"#REF!"}},{"$f":"#REF!","v":{"$error":"#REF!"}},{"$f":"#REF!","v":{"$error":"#REF!"}},{"$f":"#REF!","v":{"$error":"#REF!"}},{"$f":"#REF!","v":{"$error":"#REF!"}},{"$f":"#REF!","v":{"$error":"#REF!"}},{"$f":"#REF!","v":{"$error":"#REF!"}},{"$f":"#REF!","v":{"$error":"#REF!"}},{"$f":"#REF!","v":{"$error":"#REF!"}},{"$f":"#REF!","v":{"$error":"#REF!"}},{"$f":"#REF!","v":{"$error":"#REF!"}},{"$f":"#REF!","v":{"$error":"#REF!"}},{"$f":"IF(#REF!=\"\",\"\", AA5)","v":{"$error":"#REF!"}},{"$f":"IF(#REF!=\"\",\"\", AB5)","v":{"$error":"#REF!"}},{"$f":"IF(#REF!=\"\",\"\", AC5)","v":{"$error":"#REF!"}},{"$f":"IF(#REF!=\"\",\"\", AD5)","v":{"$error":"#REF!"}},{"$f":"IF(#REF!=\"\",\"\", AE5)","v":{"$error":"#REF!"}},{"$f":"IF(#REF!=\"\",\"\", AF5)","v":{"$error":"#REF!"}},{"$f":"IF(#REF!=\"\",\"\", AG5)","v":{"$error":"#REF!"}},{"$f":"IF(#REF!=\"\",\"\", AH5)","v":{"$error":"#REF!"}},{"$f":"IF(#REF!=\"\",\"\", AI5)","v":{"$error":"#REF!"}}]
{"$rows_left_out":33}
{"sheet":"Subrecipient Intermediate","index":7,"n_rows":51,"n_cols":26,"rows_kept":51,"cut":false,"hidden":true,"merged":[]}
["Organization/Agency","Contact Name","Position","Email","Funder*","Funder Bureau/Division*","Name of Funding Source*","NOFO/RFA Number","EHE Funding","Subrecipient","Service Delivered","Annual Budget","Geographical Area","Priority Population","Clients Served","Units Delivered","Additional Details","HIV Diagnosis","Linkage to Care","Engagement or Retention in Care","Prescription of ART","Viral Suppression","Diagnose","Treat","Prevent","Respond"]
[{"$f":"'Contact Information'!$C$6","v":0},{"$f":"'Contact Information'!$C$7","v":0},{"$f":"'Contact Information'!$C$8","v":0},{"$f":"'Contact Information'!$C$9","v":0},{"$f":"#REF!","v":{"$error":"#REF!"}},{"$f":"#REF!","v":{"$error":"#REF!"}},{"$f":"#REF!","v":{"$error":"#REF!"}},{"$f":"#REF!","v":{"$error":"#REF!"}},{"$f":"#REF!","v":{"$error":"#REF!"}},{"$f":"#REF!","v":{"$error":"#REF!"}},{"$f":"#REF!","v":{"$error":"#REF!"}},{"$f":"#REF!","v":{"$error":"#REF!"}},{"$f":"#REF!","v":{"$error":"#REF!"}},{"$f":"#REF!","v":{"$error":"#REF!"}},{"$f":"#REF!","v":{"$error":"#REF!"}},{"$f":"#REF!","v":{"$error":"#REF!"}},{"$f":"#REF!","v":{"$error":"#REF!"}},{"$f":"IF(#REF!=\"\",\"\",$R$1)","v":{"$error":"#REF!"}},{"$f":"IF(#REF!=\"\",\"\",$S$1)","v":{"$error":"#REF!"}},{"$f":"IF(#REF!=\"\",\"\",$T$1)","v":{"$error":"#REF!"}},{"$f":"IF(#REF!=\"\",\"\",$U$1)","v":{"$error":"#REF!"}},{"$f":"IF(#REF!=\"\",\"\",$V$1)","v":{"$error":"#REF!"}},{"$f":"IF(#REF!=\"\",\"\",$W$1)","v":{"$error":"#REF!"}},{"$f":"IF(#REF!=\"\",\"\",$X$1)","v":{"$error":"#REF!"}},{"$f":"IF(#REF!=\"\",\"\",$Y$1)","v":{"$error":"#REF!"}},{"$f":"IF(#REF!=\"\",\"\",$Z$1)","v":{"$error":"#REF!"}}]
[{"$f":"'Contact Information'!$C$6","v":0},{"$f":"'Contact Information'!$C$7","v":0},{"$f":"'Contact Information'!$C$8","v":0},{"$f":"'Contact Information'!$C$9","v":0},{"$f":"#REF!","v":{"$error":"#REF!"}},{"$f":"#REF!","v":{"$error":"#REF!"}},{"$f":"#REF!","v":{"$error":"#REF!"}},{"$f":"#REF!","v":{"$error":"#REF!"}},{"$f":"#REF!","v":{"$error":"#REF!"}},{"$f":"#REF!","v":{"$error":"#REF!"}},{"$f":"#REF!","v":{"$error":"#REF!"}},{"$f":"#REF!","v":{"$error":"#REF!"}},{"$f":"#REF!","v":{"$error":"#REF!"}},{"$f":"#REF!","v":{"$error":"#REF!"}},{"$f":"#REF!","v":{"$error":"#REF!"}},{"$f":"#REF!","v":{"$error":"#REF!"}},{"$f":"#REF!","v":{"$error":"#REF!"}},{"$f":"IF(#REF!=\"\",\"\",$R$1)","v":{"$error":"#REF!"}},{"$f":"IF(#REF!=\"\",\"\",$S$1)","v":{"$error":"#REF!"}},{"$f":"IF(#REF!=\"\",\"\",$T$1)","v":{"$error":"#REF!"}},{"$f":"IF(#REF!=\"\",\"\",$U$1)","v":{"$error":"#REF!"}},{"$f":"IF(#REF!=\"\",\"\",$V$1)","v":{"$error":"#REF!"}},{"$f":"IF(#REF!=\"\",\"\",$W$1)","v":{"$error":"#REF!"}},{"$f":"IF(#REF!=\"\",\"\",$X$1)","v":{"$error":"#REF!"}},{"$f":"IF(#REF!=\"\",\"\",$Y$1)","v":{"$error":"#REF!"}},{"$f":"IF(#REF!=\"\",\"\",$Z$1)","v":{"$error":"#REF!"}}]
[{"$f":"'Contact Information'!$C$6","v":0},{"$f":"'Contact Information'!$C$7","v":0},{"$f":"'Contact Information'!$C$8","v":0},{"$f":"'Contact Information'!$C$9","v":0},{"$f":"#REF!","v":{"$error":"#REF!"}},{"$f":"#REF!","v":{"$error":"#REF!"}},{"$f":"#REF!","v":{"$error":"#REF!"}},{"$f":"#REF!","v":{"$error":"#REF!"}},{"$f":"#REF!","v":{"$error":"#REF!"}},{"$f":"#REF!","v":{"$error":"#REF!"}},{"$f":"#REF!","v":{"$error":"#REF!"}},{"$f":"#REF!","v":{"$error":"#REF!"}},{"$f":"#REF!","v":{"$error":"#REF!"}},{"$f":"#REF!","v":{"$error":"#REF!"}},{"$f":"#REF!","v":{"$error":"#REF!"}},{"$f":"#REF!","v":{"$error":"#REF!"}},{"$f":"#REF!","v":{"$error":"#REF!"}},{"$f":"IF(#REF!=\"\",\"\",$R$1)","v":{"$error":"#REF!"}},{"$f":"IF(#REF!=\"\",\"\",$S$1)","v":{"$error":"#REF!"}},{"$f":"IF(#REF!=\"\",\"\",$T$1)","v":{"$error":"#REF!"}},{"$f":"IF(#REF!=\"\",\"\",$U$1)","v":{"$error":"#REF!"}},{"$f":"IF(#REF!=\"\",\"\",$V$1)","v":{"$error":"#REF!"}},{"$f":"IF(#REF!=\"\",\"\",$W$1)","v":{"$error":"#REF!"}},{"$f":"IF(#REF!=\"\",\"\",$X$1)","v":{"$error":"#REF!"}},{"$f":"IF(#REF!=\"\",\"\",$Y$1)","v":{"$error":"#REF!"}},{"$f":"IF(#REF!=\"\",\"\",$Z$1)","v":{"$error":"#REF!"}}]
[{"$f":"'Contact Information'!$C$6","v":0},{"$f":"'Contact Information'!$C$7","v":0},{"$f":"'Contact Information'!$C$8","v":0},{"$f":"'Contact Information'!$C$9","v":0},{"$f":"#REF!","v":{"$error":"#REF!"}},{"$f":"#REF!","v":{"$error":"#REF!"}},{"$f":"#REF!","v":{"$error":"#REF!"}},{"$f":"#REF!","v":{"$error":"#REF!"}},{"$f":"#REF!","v":{"$error":"#REF!"}},{"$f":"#REF!","v":{"$error":"#REF!"}},{"$f":"#REF!","v":{"$error":"#REF!"}},{"$f":"#REF!","v":{"$error":"#REF!"}},{"$f":"#REF!","v":{"$error":"#REF!"}},{"$f":"#REF!","v":{"$error":"#REF!"}},{"$f":"#REF!","v":{"$error":"#REF!"}},{"$f":"#REF!","v":{"$error":"#REF!"}},{"$f":"#REF!","v":{"$error":"#REF!"}},{"$f":"IF(#REF!=\"\",\"\",$R$1)","v":{"$error":"#REF!"}},{"$f":"IF(#REF!=\"\",\"\",$S$1)","v":{"$error":"#REF!"}},{"$f":"IF(#REF!=\"\",\"\",$T$1)","v":{"$error":"#REF!"}},{"$f":"IF(#REF!=\"\",\"\",$U$1)","v":{"$error":"#REF!"}},{"$f":"IF(#REF!=\"\",\"\",$V$1)","v":{"$error":"#REF!"}},{"$f":"IF(#REF!=\"\",\"\",$W$1)","v":{"$error":"#REF!"}},{"$f":"IF(#REF!=\"\",\"\",$X$1)","v":{"$error":"#REF!"}},{"$f":"IF(#REF!=\"\",\"\",$Y$1)","v":{"$error":"#REF!"}},{"$f":"IF(#REF!=\"\",\"\",$Z$1)","v":{"$error":"#REF!"}}]
[{"$f":"'Contact Information'!$C$6","v":0},{"$f":"'Contact Information'!$C$7","v":0},{"$f":"'Contact Information'!$C$8","v":0},{"$f":"'Contact Information'!$C$9","v":0},{"$f":"#REF!","v":{"$error":"#REF!"}},{"$f":"#REF!","v":{"$error":"#REF!"}},{"$f":"#REF!","v":{"$error":"#REF!"}},{"$f":"#REF!","v":{"$error":"#REF!"}},{"$f":"#REF!","v":{"$error":"#REF!"}},{"$f":"#REF!","v":{"$error":"#REF!"}},{"$f":"#REF!","v":{"$error":"#REF!"}},{"$f":"#REF!","v":{"$error":"#REF!"}},{"$f":"#REF!","v":{"$error":"#REF!"}},{"$f":"#REF!","v":{"$error":"#REF!"}},{"$f":"#REF!","v":{"$error":"#REF!"}},{"$f":"#REF!","v":{"$error":"#REF!"}},{"$f":"#REF!","v":{"$error":"#REF!"}},{"$f":"IF(#REF!=\"\",\"\",$R$1)","v":{"$error":"#REF!"}},{"$f":"IF(#REF!=\"\",\"\",$S$1)","v":{"$error":"#REF!"}},{"$f":"IF(#REF!=\"\",\"\",$T$1)","v":{"$error":"#REF!"}},{"$f":"IF(#REF!=\"\",\"\",$U$1)","v":{"$error":"#REF!"}},{"$f":"IF(#REF!=\"\",\"\",$V$1)","v":{"$error":"#REF!"}},{"$f":"IF(#REF!=\"\",\"\",$W$1)","v":{"$error":"#REF!"}},{"$f":"IF(#REF!=\"\",\"\",$X$1)","v":{"$error":"#REF!"}},{"$f":"IF(#REF!=\"\",\"\",$Y$1)","v":{"$error":"#REF!"}},{"$f":"IF(#REF!=\"\",\"\",$Z$1)","v":{"$error":"#REF!"}}]
{"$rows_left_out":46}
{"sheet":"FullDatabase","index":8,"n_rows":8,"n_cols":36,"rows_kept":8,"cut":false,"hidden":true,"merged":[]}
["Organization/Agency","Contact Name","Position","Email","Funder","Funder Bureau/Division","Funding Source","NOFO/RFA Number","EHE Funding","Service Delivery Agency","Total Contract Award Amount","Funding Amount (Pass through)","Funding Amount (implementing)","Contract Start Date","Contract End Date","Contract Number","Budget Year","Estimated Annual Budget","Service Delivered","Type of Service","Annual Budget","Geographical Area","Priority Population","Clients Served","Units Delivered","Additional Details","HIV Diagnosis","Linkage to Care","Engagement or Retention in Care","Prescription of ART","Viral Suppression","Diagnose","Treat","Prevent","Respond","Subrecipients"]
[0,0,0,0,"CDC","Division of HIV Prevention","Comprehensive High-Impact HIV Prevention Programs for Young Men of Color Who have Sex with Men and Young Transgender Persons of Color","PS22-2203","No","Wonderful Community Center",1075000,350000,725000,"2022-07-01","2023-06-01","A34920",0,0,"AIDS Drug Assistance Program Treatments","Implementing",50000,"A","Transgender Persons of Color (AA/Hisp), African American Women and Men Non-MSM (Age 13-44)",750,0,0,"HIV Diagnosis","Linkage to Care","","","","Diagnose","","","","State of Joy Health Department"]
[0,0,0,0,"CDC","Division of HIV Prevention","Comprehensive High-Impact HIV Prevention Programs for Young Men of Color Who have Sex with Men and Young Transgender Persons of Color","PS22-2203","No","Wonderful Community Center",1075000,350000,725000,"2022-07-01","2023-06-01","A34920",0,0,"Outpatient/Ambulatory Health Services","Implementing",4300,"A","White MSM, Young (13-29) MSM of Color (AA/Hisp)",800,0,0,"","Linkage to Care","","","","Diagnose","","","","State of Joy Health Department"]
[0,0,0,0,"RWHAP","HAB","Ryan White HIV/AIDS Program Part C","HRSA-22-011","No","Wonderful Community Center",1800000,500000,1300000,"2022-01-01","2022-12-01",0,0,0,"Partner services","Implementing",45000,"B","Transgender Persons of Color (AA/Hisp), Hispanic",570,0,0,"HIV Diagnosis","","","Prescription of ART","","","Treat","","Respond"]
[0,0,0,0,"RWHAP","HAB","Ryan White HIV/AIDS Program Part C","HRSA-22-011","No","Wonderful Community Center",1800000,500000,1300000,"2022-01-01","2022-12-01",0,0,0,"AIDS Drug Assistance Program Treatments","Implementing",60000,"B","African American Women, Young (13-29) MSM of Color (AA/Hisp)",1020,0,0,"","","","Prescription of ART","","","","","Respond"]
[0,0,0,0,"HOPWA","HUD","KDHE","HOPWA-223-39","No","Wonderful Community Center",1614340,725340,889000,"2022-05-01","2023-04-01",0,0,0,"Mental Health Services","Implementing",28300,"A","African American Women and Men Non-MSM (Age 13-44), Young (13-29) MSM of Color (AA/Hisp)",890,0,0,"","Linkage to Care","Engagement or Retention in Care","","Viral Suppression","","Treat","","Respond"]
{"$rows_left_out":3}
{"sheet":"TableDatabase","index":9,"n_rows":408,"n_cols":36,"rows_kept":408,"cut":false,"hidden":true,"merged":[]}
[]
["Organization/Agency","Contact Name","Position","Email","Funder","Funder Bureau/Division","Funding Source","NOFO/RFA Number","EHE Funding","Primary Recipient","Total Contract Award Amount","Funding Amount (Pass through)","Funding Amount (implementing)","Contract Start Date","Contract End Date","Contract Number","Budget Year","Estimated Annual Budget","Service Delivered","Type of Service","Annual Budget","Geographical Area","Priority Population","Clients Served","Units Delivered","Additional Details","HIV Diagnosis","Linkage to Care","Engagement or Retention in Care","Prescription of ART","Viral Suppression","Diagnose","Treat","Prevent","Respond","Subrecipients"]
[0,0,0,0,"CDC","Division of HIV Prevention","Comprehensive High-Impact HIV Prevention Programs for Young Men of Color Who have Sex with Men and Young Transgender Persons of Color","PS22-2203","No","Wonderful Community Center",1075000,350000,725000,"2022-07-01","2023-06-01","A34920",0,0,"AIDS Drug Assistance Program Treatments","Implementing",50000,"A","Transgender Persons of Color (AA/Hisp), African American Women and Men Non-MSM (Age 13-44)",750,0,0,"HIV Diagnosis","Linkage to Care","","","","Diagnose","","","","State of Joy Health Department"]
[0,0,0,0,"CDC","Division of HIV Prevention","Comprehensive High-Impact HIV Prevention Programs for Young Men of Color Who have Sex with Men and Young Transgender Persons of Color","PS22-2203","No","Wonderful Community Center",1075000,350000,725000,"2022-07-01","2023-06-01","A34920",0,0,"Outpatient/Ambulatory Health Services","Implementing",4300,"A","White MSM, Young (13-29) MSM of Color (AA/Hisp)",800,0,0,"","Linkage to Care","","","","Diagnose","","","","State of Joy Health Department"]
[0,0,0,0,"0","0","0","0","0","0",0,0,0,"00:00:00","00:00:00",0,0,0,"0","0",0,"12/30/1899 12:00:00 AM","12/30/1899 12:00:00 AM",0,0,0,"","","","","","","","","",0]
[0,0,0,0,"0","0","0","0","0","0",0,0,0,"00:00:00","00:00:00",0,0,0,"0","0",0,"12/30/1899 12:00:00 AM","12/30/1899 12:00:00 AM",0,0,0,"","","","","","","","","",0]
{"$rows_left_out":403}
{"sheet":"Resource Inventory Table","index":10,"n_rows":5,"n_cols":16,"rows_kept":5,"cut":false,"hidden":false,"merged":[[0,2,0,16],[1,2,1,16],[2,7,2,11],[2,12,2,15]]}
[]
[null,null,"Use this table to enter funding information, using the following category definitions:\nFunder = federal or state agency administering the funds (e.g., CDC, RWHAP, HOPWA, SAMHSA, NIH)\nFunding Source = name of the grant/funding mechanism (e.g., RWHAP Part A)\nPrimary Recipient = name of the division or agency directly receiving the funding source\nSubrecipients = name of agency(ies) who receive funding from primary recipient via the funding source\nService Delivered = specific service(s) provided through the funding source. If a particular funding source supports multiple services, we encourage you to name each service in the sheet cell, separated by commas\nHIV Care Continuum Steps Affected / EHE Strategies = use an x to indicate which of the HIV Care Continuum steps and/or EHE strategies the funding source supports"]
[null,null,null,null,null,null,null,"HIV Care Continuum Steps Affected",null,null,null,null,"EHE Strategies"]
[null,null,"Funder","Funding Source","Primary Recipient","Subrecipients","Service Delivered","HIV Diagnosis","Linkage to Care","Engagement or Retention in Care","Prescription of ART","Viral Suppression","Diagnose","Treat","Prevent","Respond"]
["2021-10-25"]